Target
Receptor-type tyrosine-protein kinase FLT3
Ligand
BDBM50056141
Substrate
Meas. Tech.
ChEMBL_1448010 (CHEMBL3380434)
IC50
406±n/a nM
Citation
 Jagtap, ADChang, PTLiu, JRWang, HCKondekar, NBShen, LJTseng, HWChen, GSChern, JW Novel acylureidoindolin-2-one derivatives as dual Aurora B/FLT3 inhibitors for the treatment of acute myeloid leukemia. Eur J Med Chem 85:268-88 (2014)  
Target
Name:
Receptor-type tyrosine-protein kinase FLT3
Synonyms:
CD135 FL cytokine receptor FLK2 FLT3 Fetal liver kinase-2 Fms-like tyrosine kinase 3 (Flt-3) STK-1 Stem cell tyrosine kinase 1
Type:
Enzyme
Mol. Mass.:
112888.62
Organism:
Homo sapiens (Human)
Description:
P36888
Residue:
993
  
Inhibitor
Name:
BDBM50056141
Synonyms:
CHEMBL3329674
Type:
Small organic molecule
Emp. Form.:
C25H20F2N4O6
Mol. Mass.:
510.4463
SMILES:
COc1ccc(C(=O)NC(=O)Nc2cc3NC(=O)\C(=C/c4[nH]c(C)c(C(O)=O)c4C)c3cc2F)c(F)c1
: