Target
Peptidyl-prolyl cis-trans isomerase NIMA-interacting 1
Ligand
BDBM50056217
Substrate
Meas. Tech.
ChEMBL_1449741 (CHEMBL3378164)
Ki
12±n/a nM
Citation
 Guo, CHou, XDong, LMarakovits, JGreasley, SDagostino, EFerre, RJohnson, MCHumphries, PSLi, HPaderes, GDPiraino, JKraynov, EMurray, BW Structure-based design of novel human Pin1 inhibitors (III): optimizing affinity beyond the phosphate recognition pocket. Bioorg Med Chem Lett 24:4187-91 (2014)  
Target
Name:
Peptidyl-prolyl cis-trans isomerase NIMA-interacting 1
Synonyms:
PIN1 PPIase Pin1 | Peptidyl-prolyl cis-trans isomerase NIMA-interacting 1
Type:
PROTEIN
Mol. Mass.:
18248.11
Organism:
Homo sapiens (Human)
Description:
ChEMBL_1502595
Residue:
163
  
Inhibitor
Name:
BDBM50056217
Synonyms:
CHEMBL3353369
Type:
Small organic molecule
Emp. Form.:
C26H21FN2O3
Mol. Mass.:
428.4549
SMILES:
OC(=O)[C@@H](Cc1cc2ccc(F)cc2[nH]1)NC(=O)CC1c2ccccc2-c2ccccc12
: