Target
ATP-dependent translocase ABCB1
Ligand
BDBM50056313
Substrate
Meas. Tech.
ChEMBL_1449768 (CHEMBL3378755)
IC50
6660±n/a nM
Citation
 Tardia, PStefanachi, ANiso, MStolfa, DAMangiatordi, GFAlberga, DNicolotti, OLattanzi, GCarotti, ALeonetti, FPerrone, RBerardi, FAzzariti, AColabufo, NACellamare, S Trimethoxybenzanilide-based P-glycoprotein modulators: an interesting case of lipophilicity tuning by intramolecular hydrogen bonding. J Med Chem 57:6403-18 (2014)  
Target
Name:
ATP-dependent translocase ABCB1
Synonyms:
ABCB1 MDR1_HUMAN Multidrug resistance protein 1 P-glycoprotein (P-gp) PGY1
Type:
Protein
Mol. Mass.:
141503.50
Organism:
Homo sapiens (Human)
Description:
P08183
Residue:
1280
  
Inhibitor
Name:
BDBM50056313
Synonyms:
CHEMBL3317937
Type:
Small organic molecule
Emp. Form.:
C22H21FN2O4
Mol. Mass.:
396.4115
SMILES:
COc1cc(cc(OC)c1OC)C(=O)N(C)c1ccc(cc1F)-c1cccnc1
: