Target
Nuclear receptor subfamily 1 group I member 2
Ligand
BDBM50056450
Substrate
Meas. Tech.
ChEMBL_1452286 (CHEMBL3366540)
EC50
>50000±n/a nM
Citation
 Santella, JBGardner, DSDuncia, JVWu, HDhar, MCavallaro, CTebben, AJCarter, PHBarrish, JCYarde, MBriceno, SWCvijic, MEGrafstrom, RRLiu, RPatel, SRWatson, AJYang, GRose, AVVickery, RDCaceres-Cortes, JCaporuscio, CCamac, DMKhan, JAAn, YFoster, WRDavies, PHynes, J Discovery of the CCR1 antagonist, BMS-817399, for the treatment of rheumatoid arthritis. J Med Chem 57:7550-64 (2014)  
Target
Name:
Nuclear receptor subfamily 1 group I member 2
Synonyms:
NR1I2 Orphan nuclear receptor PAR1 PXR SXR nuclear receptor subfamily 1 group I member 2 isoform 1
Type:
Nuclear receptor
Mol. Mass.:
49774.77
Organism:
Homo sapiens (Human)
Description:
O75469
Residue:
434
  
Inhibitor
Name:
BDBM50056450
Synonyms:
CHEMBL3334726
Type:
Small organic molecule
Emp. Form.:
C24H36ClN3O4
Mol. Mass.:
466.013
SMILES:
CC(C)[C@@H](NC(=O)N[C@@H]1CC[C@@H](O)C1)C(=O)N1CC[C@](O)(c2ccc(Cl)cc2)C(C)(C)C1
: