Target
Chemokine (C-C motif) receptor 1
Ligand
BDBM50056504
Substrate
Meas. Tech.
ChEMBL_1452294 (CHEMBL3366548)
IC50
635±n/a nM
Citation
 Santella, JBGardner, DSDuncia, JVWu, HDhar, MCavallaro, CTebben, AJCarter, PHBarrish, JCYarde, MBriceno, SWCvijic, MEGrafstrom, RRLiu, RPatel, SRWatson, AJYang, GRose, AVVickery, RDCaceres-Cortes, JCaporuscio, CCamac, DMKhan, JAAn, YFoster, WRDavies, PHynes, J Discovery of the CCR1 antagonist, BMS-817399, for the treatment of rheumatoid arthritis. J Med Chem 57:7550-64 (2014)  
Target
Name:
Chemokine (C-C motif) receptor 1
Synonyms:
CCR1 | Chemokine (C-C motif) receptor 1
Type:
PROTEIN
Mol. Mass.:
40875.91
Organism:
Canis familiaris
Description:
ChEMBL_109478
Residue:
354
  
Inhibitor
Name:
BDBM50056504
Synonyms:
CHEMBL3334824
Type:
Small organic molecule
Emp. Form.:
C23H36ClN3O4
Mol. Mass.:
454.003
SMILES:
CC(C)[C@@H](NC(=O)NCC(C)(C)O)C(=O)N1CC[C@](O)(c2ccc(Cl)cc2)C(C)(C)C1
: