Target
C-C chemokine receptor type 1
Ligand
BDBM50056504
Substrate
Meas. Tech.
ChEMBL_1452304 (CHEMBL3366558)
IC50
14±n/a nM
Citation
 Santella, JBGardner, DSDuncia, JVWu, HDhar, MCavallaro, CTebben, AJCarter, PHBarrish, JCYarde, MBriceno, SWCvijic, MEGrafstrom, RRLiu, RPatel, SRWatson, AJYang, GRose, AVVickery, RDCaceres-Cortes, JCaporuscio, CCamac, DMKhan, JAAn, YFoster, WRDavies, PHynes, J Discovery of the CCR1 antagonist, BMS-817399, for the treatment of rheumatoid arthritis. J Med Chem 57:7550-64 (2014)  
Target
Name:
C-C chemokine receptor type 1
Synonyms:
C-C CKR-1 CC-CKR-1 CCR1 CD_antigen=CD191 CMKR1 LD78 receptor Macrophage inflammatory protein 1-alpha receptor SCYAR1
Type:
Enzyme
Mol. Mass.:
41180.69
Organism:
Homo sapiens (Human)
Description:
P32246
Residue:
355
  
Inhibitor
Name:
BDBM50056504
Synonyms:
CHEMBL3334824
Type:
Small organic molecule
Emp. Form.:
C23H36ClN3O4
Mol. Mass.:
454.003
SMILES:
CC(C)[C@@H](NC(=O)NCC(C)(C)O)C(=O)N1CC[C@](O)(c2ccc(Cl)cc2)C(C)(C)C1
: