Target
Cytosolic phospholipase A2
Ligand
BDBM50056736
Substrate
Meas. Tech.
ChEMBL_1454057 (CHEMBL3361803)
IC50
77±n/a nM
Citation
 Tomoo, TNakatsuka, TKatayama, THayashi, YFujieda, YTerakawa, MNagahira, K Design, synthesis, and biological evaluation of 3-(1-Aryl-1H-indol-5-yl)propanoic acids as new indole-based cytosolic phospholipase A2a inhibitors. J Med Chem 57:7244-62 (2014)  
Target
Name:
Cytosolic phospholipase A2
Synonyms:
CPLA2 PA24A_HUMAN PLA2G4A Phospholipase A2 | Phospholipase A2 group IVA
Type:
Protein
Mol. Mass.:
85219.30
Organism:
Homo sapiens (Human)
Description:
P47712
Residue:
749
  
Inhibitor
Name:
BDBM50056736
Synonyms:
CHEMBL3327093
Type:
Small organic molecule
Emp. Form.:
C30H36N2O5
Mol. Mass.:
504.6172
SMILES:
NC(CO)(CO)CO.Cc1ccc(cc1)-n1cc(CCc2ccccc2)c2cc(CCC(O)=O)ccc12
: