Target
Tubulin beta chain
Ligand
BDBM50056783
Substrate
Meas. Tech.
ChEMBL_1455831 (CHEMBL3361924)
IC50
2200±n/a nM
Citation
 Solum, EJCheng, JJSørvik, IBPaulsen, REVik, AHansen, TV Synthesis and biological evaluations of new analogs of 2-methoxyestradiol: inhibitors of tubulin and angiogenesis. Eur J Med Chem 85:391-8 (2014)  
Target
Name:
Tubulin beta chain
Synonyms:
Beta-tubulin Tubulin beta chain
Type:
PROTEIN
Mol. Mass.:
49840.26
Organism:
Sus scrofa
Description:
ChEMBL_105107
Residue:
445
  
Inhibitor
Name:
BDBM50056783
Synonyms:
CHEMBL3331351
Type:
Small organic molecule
Emp. Form.:
C28H29NO2
Mol. Mass.:
411.5354
SMILES:
[H][C@@]12CC=C(c3ccc4cnccc4c3)[C@@]1(C)CC[C@]1([H])c3cc(OC)c(O)cc3CC[C@@]21[H]
: