Target
Xanthine dehydrogenase/oxidase
Ligand
BDBM50057015
Substrate
Meas. Tech.
ChEMBL_1458654 (CHEMBL3367448)
Ki
2.3±n/a nM
Citation
 Guan, QCheng, ZMa, XWang, LFeng, DCui, YBao, KWu, LZhang, W Synthesis and bioevaluation of 2-phenyl-4-methyl-1,3-selenazole-5-carboxylic acids as potent xanthine oxidase inhibitors. Eur J Med Chem 85:508-16 (2014)  
Target
Name:
Xanthine dehydrogenase/oxidase
Synonyms:
XDH Xanthine dehydrogenase Xanthine oxidase (XO)
Type:
Protein
Mol. Mass.:
146809.00
Organism:
Bos taurus (Bovine)
Description:
P80457
Residue:
1332
  
Inhibitor
Name:
BDBM50057015
Synonyms:
CHEMBL3331617
Type:
Small organic molecule
Emp. Form.:
C15H12N2O3Se
Mol. Mass.:
347.23
SMILES:
Cc1nc([se]c1C(O)=O)-c1ccc(OCC=C)c(c1)C#N
: