Target
Receptor-type tyrosine-protein phosphatase F
Ligand
BDBM50391109
Substrate
Meas. Tech.
ChEMBL_1448899 (CHEMBL3375101)
IC50
141000±n/a nM
Citation
 Li, YYu, YJin, KGao, LLuo, TSheng, LShao, XLi, J Synthesis and biological evaluation of novel thiadiazole amides as potent Cdc25B and PTP1B inhibitors. Bioorg Med Chem Lett 24:4125-8 (2014)  
Target
Name:
Receptor-type tyrosine-protein phosphatase F
Synonyms:
LAR Leukocyte common antigen related (LAR) PTPRF_HUMAN Receptor-type tyrosine-protein phosphatase F (LAR)
Type:
Protein
Mol. Mass.:
212869.85
Organism:
Homo sapiens (Human)
Description:
P10586
Residue:
1907
  
Inhibitor
Name:
BDBM50391109
Synonyms:
CHEMBL179166 Vanadates
Type:
Small organic molecule
Emp. Form.:
O4V
Mol. Mass.:
114.9407
SMILES:
[O-][V]([O-])([O-])=O
: