Target
Tyrosine-protein phosphatase non-receptor type 1
Ligand
BDBM50057658
Substrate
Meas. Tech.
ChEMBL_1448900 (CHEMBL3375102)
IC50
3600±n/a nM
Citation
 Li, YYu, YJin, KGao, LLuo, TSheng, LShao, XLi, J Synthesis and biological evaluation of novel thiadiazole amides as potent Cdc25B and PTP1B inhibitors. Bioorg Med Chem Lett 24:4125-8 (2014)  
Target
Name:
Tyrosine-protein phosphatase non-receptor type 1
Synonyms:
PTN1_HUMAN PTPN1 Protein tyrosine phosphatase-1B (PTP1B) Protein-tyrosine phosphatase 1B (PTP1B) Tyrosine-protein phosphatase non-receptor type 1 (PTP1B)
Type:
Protein phosphatase
Mol. Mass.:
49963.76
Organism:
Homo sapiens (Human)
Description:
Human recombinant GST-fusion PTP1B (1-435).
Residue:
435
  
Inhibitor
Name:
BDBM50057658
Synonyms:
CHEMBL3322840
Type:
Small organic molecule
Emp. Form.:
C21H13N5O6S
Mol. Mass.:
463.423
SMILES:
[O-][N+](=O)c1ccc(Oc2ccc(cc2)-c2nnc(NC(=O)c3ccc(cc3)[N+]([O-])=O)s2)cc1
: