Target
Phosphodiesterase
Ligand
BDBM50058063
Substrate
Meas. Tech.
ChEMBL_1452390 (CHEMBL3361696)
IC50
11000±n/a nM
Citation
 Amata, EBland, NDHoyt, CTSettimo, LCampbell, RKPollastri, MP Repurposing human PDE4 inhibitors for neglected tropical diseases: design, synthesis and evaluation of cilomilast analogues as Trypanosoma brucei PDEB1 inhibitors. Bioorg Med Chem Lett 24:4084-9 (2014)  
Target
Name:
Phosphodiesterase
Synonyms:
Class 1 phosphodiesterase PDEB1 PDEB1
Type:
Protein
Mol. Mass.:
103683.20
Organism:
Trypanosoma brucei
Description:
Residue:
930
  
Inhibitor
Name:
BDBM50058063
Synonyms:
CHEMBL3323129
Type:
Small organic molecule
Emp. Form.:
C24H27NO5
Mol. Mass.:
409.4749
SMILES:
COc1ccc(cc1OCCCOc1ccccc1)[C@]1(CC[C@@H](CC1)C(O)=O)C#N
: