Target
DNA topoisomerase 4 subunit B
Ligand
BDBM50058511
Substrate
Meas. Tech.
ChEMBL_1448970 (CHEMBL3376317)
IC50
780±n/a nM
Citation
 Yule, IACzaplewski, LGPommier, SDavies, DTNarramore, SKFishwick, CW Pyridine-3-carboxamide-6-yl-ureas as novel inhibitors of bacterial DNA gyrase: structure based design, synthesis, SAR and antimicrobial activity. Eur J Med Chem 86:31-8 (2014)  
Target
Name:
DNA topoisomerase 4 subunit B
Synonyms:
DNA Topoisomerase IV Subunit B PARE_ECOLI parE
Type:
Enzyme Subunit
Mol. Mass.:
70233.03
Organism:
Escherichia coli (strain K12)
Description:
Residue:
630
  
Inhibitor
Name:
BDBM50058511
Synonyms:
CHEMBL3329318
Type:
Small organic molecule
Emp. Form.:
C20H20N6O3
Mol. Mass.:
392.4112
SMILES:
CCNC(=O)Nc1cc(Nc2cccc(O)c2)c(cn1)C(=O)Nc1cccnc1
: