Target
Endothelial PAS domain-containing protein 1/Hypoxia-inducible factor 1-alpha
Ligand
BDBM50058768
Substrate
Meas. Tech.
ChEMBL_1449896 (CHEMBL3380585)
IC50
14±n/a nM
Citation
 Nagao, SYamane, YFunasaka, STanaka, KMiyazaki, KKotake, YKamata, JWatanabe-Miyano, SToyama, OOzawa, YMizui, YOkamoto, KIto, D Synthesis and structure-activity relationships of novel, potent, orally active hypoxia-inducible factor-1 inhibitors. Bioorg Med Chem 22:5513-29 (2014)  
Target
Name:
Endothelial PAS domain-containing protein 1/Hypoxia-inducible factor 1-alpha
Synonyms:
Hypoxia inducible factors; HIF-1-alpha, HIF-2-alpha
Type:
Mol. Mass.:
Description:
ASSAY_ID of ChEMBL is 799337
Components:
This complex has 2 components.
Component 1
Name:
Hypoxia-inducible factor 1-alpha
Synonyms:
BHLHE78 HIF-1-alpha, HIF-2-alpha HIF1A_HUMAN Hypoxia-inducible factor 1 alpha MOP1 von Hippel-Lindau disease tumor suppressor/Elongin-C/Elongin-B/HIF1A
Type:
Protein
Mol. Mass.:
92647.24
Organism:
Homo sapiens (Human)
Description:
Q16665
Residue:
826
  
Component 2
Name:
Endothelial PAS domain-containing protein 1
Synonyms:
BHLHE73 EPAS1_HUMAN MOP2 endothelial PAS domain-containing protein 1
Type:
PROTEIN
Mol. Mass.:
96453.58
Organism:
Homo sapiens (Human)
Description:
ChEMBL_1506501
Residue:
870
  
Inhibitor
Name:
BDBM50058768
Synonyms:
CHEMBL3335413
Type:
Small organic molecule
Emp. Form.:
C25H25F3N4O
Mol. Mass.:
454.4874
SMILES:
FC(F)(F)c1ccc(NC(=O)c2ccc(CN3CCN(Cc4cccnc4)CC3)cc2)cc1
: