Target
Inosine-5'-monophosphate dehydrogenase
Ligand
BDBM50432791
Substrate
Meas. Tech.
ChEMBL_1452432 (CHEMBL3362456)
Ki
24±n/a nM
Citation
 Mandapati, KGorla, SKHouse, ALMcKenney, ESZhang, MRao, SNGollapalli, DRMann, BJGoldberg, JBCuny, GDGlomski, IJHedstrom, L Repurposing cryptosporidium inosine 5'-monophosphate dehydrogenase inhibitors as potential antibacterial agents. ACS Med Chem Lett 5:846-50 (2014)  
Target
Name:
Inosine-5'-monophosphate dehydrogenase
Synonyms:
AB164_07585 AB166_11280 AB168_06335 AB170_00090 AB893_00065 ADT20_14595 BF27_2004 | guaB
Type:
PROTEIN
Mol. Mass.:
52375.32
Organism:
Bacillus anthracis
Description:
ChEMBL_109471
Residue:
487
  
Inhibitor
Name:
BDBM50432791
Synonyms:
CHEMBL2348823
Type:
Small organic molecule
Emp. Form.:
C25H19N3O3
Mol. Mass.:
409.4367
SMILES:
C[C@H](Oc1cccc2ccccc12)C(=O)Nc1ccc2oc(nc2c1)-c1ccncc1
: