Target
Inosine-5'-monophosphate dehydrogenase
Ligand
BDBM81428
Substrate
Meas. Tech.
ChEMBL_1452448 (CHEMBL3362472)
Ki
44±n/a nM
Citation
 Mandapati, KGorla, SKHouse, ALMcKenney, ESZhang, MRao, SNGollapalli, DRMann, BJGoldberg, JBCuny, GDGlomski, IJHedstrom, L Repurposing cryptosporidium inosine 5'-monophosphate dehydrogenase inhibitors as potential antibacterial agents. ACS Med Chem Lett 5:846-50 (2014)  
Target
Name:
Inosine-5'-monophosphate dehydrogenase
Synonyms:
AB164_07585 AB166_11280 AB168_06335 AB170_00090 AB893_00065 ADT20_14595 BF27_2004 | guaB
Type:
PROTEIN
Mol. Mass.:
52375.32
Organism:
Bacillus anthracis
Description:
ChEMBL_109471
Residue:
487
  
Inhibitor
Name:
BDBM81428
Synonyms:
N-(naphthalen-2-yl)-2-[2-(pyridin-2-yl)-1H-1,3-benzodiazol-1-yl]acetamide, Compound C91
Type:
Small organic molecule
Emp. Form.:
C24H18N4O
Mol. Mass.:
378.4259
SMILES:
O=C(Cn1c(nc2ccccc12)-c1ccccn1)Nc1ccc2ccccc2c1
: