Target
Inosine-5'-monophosphate dehydrogenase
Ligand
BDBM50100980
Substrate
Meas. Tech.
ChEMBL_1452433 (CHEMBL3362457)
Ki
2.0±n/a nM
Citation
 Mandapati, KGorla, SKHouse, ALMcKenney, ESZhang, MRao, SNGollapalli, DRMann, BJGoldberg, JBCuny, GDGlomski, IJHedstrom, L Repurposing cryptosporidium inosine 5'-monophosphate dehydrogenase inhibitors as potential antibacterial agents. ACS Med Chem Lett 5:846-50 (2014)  
Target
Name:
Inosine-5'-monophosphate dehydrogenase
Synonyms:
Cgd6_20 protein Inosine-5'-monophosphate dehydrogenase, probable | Inosine-5-monophosphate dehydrogenase (IMPDH)
Type:
Protein
Mol. Mass.:
43076.80
Organism:
Cryptosporidium parvum
Description:
Q8T6T2
Residue:
400
  
Inhibitor
Name:
BDBM50100980
Synonyms:
CHEMBL2178617
Type:
Small organic molecule
Emp. Form.:
C19H21ClN4O3
Mol. Mass.:
388.848
SMILES:
C\C(=N/O)c1cccc(c1)C(C)(C)NC(=O)Nc1ccc(Cl)c(c1)C(N)=O
: