Target
Carbonic anhydrase 1
Ligand
BDBM50059079
Substrate
Meas. Tech.
ChEMBL_1456924 (CHEMBL3368141)
Ki
765±n/a nM
Citation
 Pala, NMicheletto, LSechi, MAggarwal, MCarta, FMcKenna, RSupuran, CT Carbonic Anhydrase Inhibition with Benzenesulfonamides and Tetrafluorobenzenesulfonamides Obtained via Click Chemistry. ACS Med Chem Lett 5:927-30 (2014)  
Target
Name:
Carbonic anhydrase 1
Synonyms:
CA-I CAB Carbonate dehydratase I Carbonic anhydrase 1 (CA I) Carbonic anhydrase 1 (Recombinant CA I) Carbonic anhydrase B Carbonic anhydrase I (CA I) Carbonic anhydrase I (CAI) Carbonic anhydrase isoenzyme I (hCA I) | hCA
Type:
Enzyme
Mol. Mass.:
28873.37
Organism:
Homo sapiens (Human)
Description:
P00915
Residue:
261
  
Inhibitor
Name:
BDBM50059079
Synonyms:
CHEMBL3326408
Type:
Small organic molecule
Emp. Form.:
C9H11N5O2S
Mol. Mass.:
253.281
SMILES:
NCc1cn(nn1)-c1ccc(cc1)S(N)(=O)=O
: