Target
Mitogen-activated protein kinase 14
Ligand
BDBM50059184
Substrate
Meas. Tech.
ChEMBL_1460844 (CHEMBL3396501)
IC50
2100±n/a nM
Citation
 Cumming, JGDebreczeni, JÉEdfeldt, FEvertsson, EHarrison, MHoldgate, GAJames, MJLamont, SGOldham, KSullivan, JEWells, SL Discovery and characterization of MAPK-activated protein kinase-2 prevention of activation inhibitors. J Med Chem 58:278-93 (2015)  
Target
Name:
Mitogen-activated protein kinase 14
Synonyms:
CSAID-binding protein CSBP1 CSPB1 MAP kinase 14 MAP kinase p38 alpha MAPK14 MK14_HUMAN Mitogen-activated protein kinase p38 alpha Stress-activated protein kinase 2a | p38 MAP kinase alpha/beta
Type:
Serine/threonine-protein kinase
Mol. Mass.:
41286.76
Organism:
Homo sapiens (Human)
Description:
Q16539
Residue:
360
  
Inhibitor
Name:
BDBM50059184
Synonyms:
CHEMBL3393291
Type:
Small organic molecule
Emp. Form.:
C19H15FN2O2
Mol. Mass.:
322.333
SMILES:
Fc1ccc(Oc2ccc(cc2)C(=O)NCc2ccncc2)cc1
: