Target
Mitogen-activated protein kinase kinase kinase 12
Ligand
BDBM50059194
Substrate
Meas. Tech.
ChEMBL_1460553 (CHEMBL3395585)
Ki
0.200000±n/a nM
Citation
 Patel, SCohen, FDean, BJDe La Torre, KDeshmukh, GEstrada, AAGhosh, ASGibbons, PGustafson, AHuestis, MPLe Pichon, CELin, HLiu, WLiu, XLiu, YLy, CQLyssikatos, JPMa, CScearce-Levie, KShin, YGSolanoy, HStark, KLWang, JWang, BZhao, XLewcock, JWSiu, M Discovery of dual leucine zipper kinase (DLK, MAP3K12) inhibitors with activity in neurodegeneration models. J Med Chem 58:401-18 (2015)  
Target
Name:
Mitogen-activated protein kinase kinase kinase 12
Synonyms:
DLK Leucine-zipper protein kinase MAP3K12 MUK Mixed lineage kinase | ZPK
Type:
PROTEIN
Mol. Mass.:
93216.56
Organism:
Homo sapiens (Human)
Description:
ChEMBL_1460553
Residue:
859
  
Inhibitor
Name:
BDBM50059194
Synonyms:
CHEMBL3393337
Type:
Small organic molecule
Emp. Form.:
C23H27N5O2
Mol. Mass.:
405.4928
SMILES:
N#Cc1ccnc(Nc2cc(cc(OC3CCC3)n2)C2CCN(CC2)C2COC2)c1
: