Target
Mitogen-activated protein kinase kinase kinase 12
Ligand
BDBM50059206
Substrate
Meas. Tech.
ChEMBL_1460553 (CHEMBL3395585)
Ki
7.0±n/a nM
Citation
 Patel, SCohen, FDean, BJDe La Torre, KDeshmukh, GEstrada, AAGhosh, ASGibbons, PGustafson, AHuestis, MPLe Pichon, CELin, HLiu, WLiu, XLiu, YLy, CQLyssikatos, JPMa, CScearce-Levie, KShin, YGSolanoy, HStark, KLWang, JWang, BZhao, XLewcock, JWSiu, M Discovery of dual leucine zipper kinase (DLK, MAP3K12) inhibitors with activity in neurodegeneration models. J Med Chem 58:401-18 (2015)  
Target
Name:
Mitogen-activated protein kinase kinase kinase 12
Synonyms:
DLK Leucine-zipper protein kinase MAP3K12 MUK Mixed lineage kinase | ZPK
Type:
PROTEIN
Mol. Mass.:
93216.56
Organism:
Homo sapiens (Human)
Description:
ChEMBL_1460553
Residue:
859
  
Inhibitor
Name:
BDBM50059206
Synonyms:
CHEMBL3393321
Type:
Small organic molecule
Emp. Form.:
C19H21F5N6
Mol. Mass.:
428.4023
SMILES:
FC(F)(F)c1ccnc(Nc2cc(nc(n2)N2CCC(F)(F)C2)C2CCCNC2)c1
: