Target
Mitogen-activated protein kinase kinase kinase 12
Ligand
BDBM50059212
Substrate
Meas. Tech.
ChEMBL_1460553 (CHEMBL3395585)
Ki
24±n/a nM
Citation
 Patel, SCohen, FDean, BJDe La Torre, KDeshmukh, GEstrada, AAGhosh, ASGibbons, PGustafson, AHuestis, MPLe Pichon, CELin, HLiu, WLiu, XLiu, YLy, CQLyssikatos, JPMa, CScearce-Levie, KShin, YGSolanoy, HStark, KLWang, JWang, BZhao, XLewcock, JWSiu, M Discovery of dual leucine zipper kinase (DLK, MAP3K12) inhibitors with activity in neurodegeneration models. J Med Chem 58:401-18 (2015)  
Target
Name:
Mitogen-activated protein kinase kinase kinase 12
Synonyms:
DLK Leucine-zipper protein kinase MAP3K12 MUK Mixed lineage kinase | ZPK
Type:
PROTEIN
Mol. Mass.:
93216.56
Organism:
Homo sapiens (Human)
Description:
ChEMBL_1460553
Residue:
859
  
Inhibitor
Name:
BDBM50059212
Synonyms:
CHEMBL3393312
Type:
Small organic molecule
Emp. Form.:
C23H22F3N5O
Mol. Mass.:
441.4489
SMILES:
Cc1nc(Nc2cc(ccn2)C(F)(F)F)cc(n1)C1CCCN(C1)C(=O)c1ccccc1
: