Target
Leucine-rich repeat serine/threonine-protein kinase 2
Ligand
BDBM50059311
Substrate
Meas. Tech.
ChEMBL_1460596 (CHEMBL3395726)
IC50
18±n/a nM
Citation
 Henderson, JLKormos, BLHayward, MMCoffman, KJJasti, JKurumbail, RGWager, TTVerhoest, PRNoell, GSChen, YNeedle, EBerger, ZSteyn, SJHoule, CHirst, WDGalatsis, P Discovery and preclinical profiling of 3-[4-(morpholin-4-yl)-7H-pyrrolo[2,3-d]pyrimidin-5-yl]benzonitrile (PF-06447475), a highly potent, selective, brain penetrant, and in vivo active LRRK2 kinase inhibitor. J Med Chem 58:419-32 (2015)  
Target
Name:
Leucine-rich repeat serine/threonine-protein kinase 2
Synonyms:
Dardarin LRRK2_HUMAN Leucine-rich repeat serine/threonine-protein kinase 2 PARK8
Type:
Protein
Mol. Mass.:
286113.20
Organism:
Homo sapiens (Human)
Description:
Q5S007
Residue:
2527
  
Inhibitor
Name:
BDBM50059311
Synonyms:
CHEMBL3393443 | US9156845, 79
Type:
Small organic molecule
Emp. Form.:
C18H17N5O
Mol. Mass.:
319.3605
SMILES:
C[C@@H]1CN(CCO1)c1ncnc2[nH]cc(-c3cccc(c3)C#N)c12
: