Target
Cytochrome P450 3A4
Ligand
BDBM50059444
Substrate
Meas. Tech.
ChEMBL_1460909 (CHEMBL3396729)
IC50
12000±n/a nM
Target
Name:
Cytochrome P450 3A4
Synonyms:
Albendazole monooxygenase CP3A4_HUMAN CYP3A4 CYPIIIA4 Cytochrome P450 3A4 (CYP3A4) Nifedipine oxidase Taurochenodeoxycholate 6-alpha-hydroxylase
Type:
Enzyme
Mol. Mass.:
57349.57
Organism:
Homo sapiens (Human)
Description:
Residue:
503
  
Inhibitor
Name:
BDBM50059444
Synonyms:
CHEMBL3393473
Type:
Small organic molecule
Emp. Form.:
C25H21FN4O4S
Mol. Mass.:
492.522
SMILES:
CCOC(=O)c1[nH]cc2C(c3ccc(Sc4nc5cc(F)ccc5[nH]4)o3)C3=C(CCCC3=O)Nc12
: