Target
DNA-dependent protein kinase catalytic subunit
Ligand
BDBM12915
Substrate
Meas. Tech.
ChEMBL_1460638 (CHEMBL3395879)
IC50
1200±n/a nM
Citation
 Andrs, MKorabecny, JJun, DHodny, ZBartek, JKuca, K Phosphatidylinositol 3-Kinase (PI3K) and phosphatidylinositol 3-kinase-related kinase (PIKK) inhibitors: importance of the morpholine ring. J Med Chem 58:41-71 (2015)  
Target
Name:
DNA-dependent protein kinase catalytic subunit
Synonyms:
DNA-PK catalytic subunit DNA-dependent protein kinase (DNA-PK) DNA-dependent protein kinase catalytic subunit (DNA-PK) HYRC PRKDC | PRKDC_HUMAN
Type:
Protein
Mol. Mass.:
469114.78
Organism:
Homo sapiens (Human)
Description:
P78527
Residue:
4128
  
Inhibitor
Name:
BDBM12915
Synonyms:
2-(4-Morpholinyl)-8-phenyl-4H-1-benzopyran-4-one CHEMBL98350 US10308662, Compound LY294002 | US9505780, LY294002
Type:
Small organic molecule
Emp. Form.:
C19H17NO3
Mol. Mass.:
307.3432
SMILES:
O=c1cc(oc2c(cccc12)-c1ccccc1)N1CCOCC1
: