Target
Cytochrome P450 2D6
Ligand
BDBM50059654
Substrate
Meas. Tech.
ChEMBL_1460674 (CHEMBL3395915)
IC50
>50000±n/a nM
Citation
 Koch, PGehringer, MLaufer, SA Inhibitors of c-Jun N-terminal kinases: an update. J Med Chem 58:72-95 (2015)  
Target
Name:
Cytochrome P450 2D6
Synonyms:
CP2D6_HUMAN CYP2DL1 Cytochrome P450 2D6 (CYP2D6) P450-DB1
Type:
Protein
Mol. Mass.:
55774.82
Organism:
Homo sapiens (Human)
Description:
P10635
Residue:
497
  
Inhibitor
Name:
BDBM50059654
Synonyms:
CHEMBL2144409
Type:
Small organic molecule
Emp. Form.:
C28H26N8O
Mol. Mass.:
490.559
SMILES:
Cc1ccc(cn1)-c1ncn(n1)-c1ccc(Nc2nccc(n2)-c2cccc(c2)N2CCOCC2)cc1
: