Target
Cytochrome P450 1A2
Ligand
BDBM50059654
Substrate
Meas. Tech.
ChEMBL_1460668 (CHEMBL3395909)
IC50
>50000±n/a nM
Citation
 Koch, PGehringer, MLaufer, SA Inhibitors of c-Jun N-terminal kinases: an update. J Med Chem 58:72-95 (2015)  
Target
Name:
Cytochrome P450 1A2
Synonyms:
CP1A2_HUMAN CYPIA2 Cytochrome P(3)450 Cytochrome P450 1A2 (CYP1A2) Cytochrome P450-P3
Type:
Enzyme
Mol. Mass.:
58423.38
Organism:
Homo sapiens (Human)
Description:
P05177
Residue:
516
  
Inhibitor
Name:
BDBM50059654
Synonyms:
CHEMBL2144409
Type:
Small organic molecule
Emp. Form.:
C28H26N8O
Mol. Mass.:
490.559
SMILES:
Cc1ccc(cn1)-c1ncn(n1)-c1ccc(Nc2nccc(n2)-c2cccc(c2)N2CCOCC2)cc1
: