Target
Protein kinase C epsilon type
Ligand
BDBM50059713
Substrate
Meas. Tech.
ChEMBL_1460977 (CHEMBL3396876)
Ki
4.8±n/a nM
Citation
 Ann, JYoon, SBaek, JKim, da HLewin, NEHill, CSBlumberg, PMLee, J Design and synthesis of protein kinase C epsilon selective diacylglycerol lactones (DAG-lactones). Eur J Med Chem 90:332-41 (2015)  
Target
Name:
Protein kinase C epsilon type
Synonyms:
KPCE_HUMAN PKCE Protein kinase C epsilon Protein kinase C, PKC; classical/novel nPKC-epsilon
Type:
Enzyme
Mol. Mass.:
83680.45
Organism:
Homo sapiens (Human)
Description:
The recombinant human PKC enzymes were produced using a baculovirus expression system in SF9 cells
Residue:
737
  
Inhibitor
Name:
BDBM50059713
Synonyms:
CHEMBL3393750
Type:
Small organic molecule
Emp. Form.:
C29H48O5
Mol. Mass.:
476.6884
SMILES:
CCCCCCCCC#CCCCCCCCC(=O)OCC1(CO)C\C(=C/CC(C)C)C(=O)O1
: