Target
Protein kinase C epsilon type
Ligand
BDBM50059669
Substrate
Meas. Tech.
ChEMBL_1460977 (CHEMBL3396876)
Ki
12±n/a nM
Citation
 Ann, JYoon, SBaek, JKim, da HLewin, NEHill, CSBlumberg, PMLee, J Design and synthesis of protein kinase C epsilon selective diacylglycerol lactones (DAG-lactones). Eur J Med Chem 90:332-41 (2015)  
Target
Name:
Protein kinase C epsilon type
Synonyms:
KPCE_HUMAN PKCE Protein kinase C epsilon Protein kinase C, PKC; classical/novel nPKC-epsilon
Type:
Enzyme
Mol. Mass.:
83680.45
Organism:
Homo sapiens (Human)
Description:
The recombinant human PKC enzymes were produced using a baculovirus expression system in SF9 cells
Residue:
737
  
Inhibitor
Name:
BDBM50059669
Synonyms:
CHEMBL3393757
Type:
Small organic molecule
Emp. Form.:
C29H52O5
Mol. Mass.:
480.7202
SMILES:
CCCCCCCCCCCCCCCCC\C=C1/CC(=O)OC1(CO)COC(=O)C(C)(C)C
: