Target
Hypoxanthine-guanine phosphoribosyltransferase
Ligand
BDBM50059912
Substrate
Meas. Tech.
ChEMBL_1461452 (CHEMBL3396536)
Ki
1000±n/a nM
Citation
 Keough, DTHocková, DJaneba, ZWang, THNaesens, LEdstein, MDChavchich, MGuddat, LW Aza-acyclic nucleoside phosphonates containing a second phosphonate group as inhibitors of the human, Plasmodium falciparum and vivax 6-oxopurine phosphoribosyltransferases and their prodrugs as antimalarial agents. J Med Chem 58:827-46 (2015)  
Target
Name:
Hypoxanthine-guanine phosphoribosyltransferase
Synonyms:
HGPRT HPRT HPRT_HUMAN Hypoxanthine-guanine phosphoribosyltransferase (HGPRT)
Type:
Protein
Mol. Mass.:
24579.61
Organism:
Homo sapiens (Human)
Description:
P00492
Residue:
218
  
Inhibitor
Name:
BDBM50059912
Synonyms:
CHEMBL3394313
Type:
Small organic molecule
Emp. Form.:
C13H23N5O8P2
Mol. Mass.:
439.2979
SMILES:
OP(O)(=O)CCOCCN(CCn1cnc2c1nc[nH]c2=O)CCP(O)(O)=O
: