Target
Carbonic anhydrase 2
Ligand
BDBM10885
Substrate
Meas. Tech.
ChEMBL_1461813 (CHEMBL3395807)
Ki
3.0±n/a nM
Citation
 Vullo, DDel Prete, SFisher, GMAndrews, KTPoulsen, SACapasso, CSupuran, CT Sulfonamide inhibition studies of theż-class carbonic anhydrase from the malaria pathogen Plasmodium falciparum. Bioorg Med Chem 23:526-31 (2015)  
Target
Name:
Carbonic anhydrase 2
Synonyms:
CA-II CAC Carbonate dehydratase II Carbonic anhydrase 2 (CA-II) Carbonic anhydrase C Carbonic anhydrase II (CA-II) Carbonic anhydrase II (hCA II) | Carbonic anhydrase isoenzyme II (hCA II)
Type:
Enzyme
Mol. Mass.:
29250.71
Organism:
Homo sapiens (Human)
Description:
P00918
Residue:
260
  
Inhibitor
Name:
BDBM10885
Synonyms:
(4R)-4-(ethylamino)-2-(3-methoxypropyl)-1,1-dioxo-2H,3H,4H-1,7,2-thieno[3,2-e][1,2]thiazine-6-sulfonamide AL-4862 Brinzolamide (BRZ) | brinzolamide
Type:
Small organic molecule
Emp. Form.:
C12H21N3O5S3
Mol. Mass.:
383.507
SMILES:
CCN[C@H]1CN(CCCOC)S(=O)(=O)c2sc(cc12)S(N)(=O)=O
: