Target
Hepatocyte growth factor receptor
Ligand
BDBM50060513
Substrate
Meas. Tech.
ChEMBL_1461891 (CHEMBL3396121)
IC50
58±n/a nM
Citation
 Jiang, XLiu, HSong, ZPeng, XJi, YYao, QGeng, MAi, JZhang, A Discovery and SAR study of c-Met kinase inhibitors bearing an 3-amino-benzo[d]isoxazole or 3-aminoindazole scaffold. Bioorg Med Chem 23:564-78 (2015)  
Target
Name:
Hepatocyte growth factor receptor
Synonyms:
Hepatocyte growth factor receptor Hepatocyte growth factor receptor (c-MET) MET Met proto-oncogene (hepatocyte growth factor receptor) Tyrosine-protein kinase Met (c-Met) c-Met kinase
Type:
Protein
Mol. Mass.:
155559.73
Organism:
Homo sapiens (Human)
Description:
P08581
Residue:
1390
  
Inhibitor
Name:
BDBM50060513
Synonyms:
CHEMBL3394453
Type:
Small organic molecule
Emp. Form.:
C25H21FN4O4
Mol. Mass.:
460.457
SMILES:
COc1cc(NC(=O)C2(CC2)C(=O)Nc2ccc(cc2)-c2cccc3onc(N)c23)ccc1F
: