Target
Hepatocyte growth factor receptor
Ligand
BDBM50060531
Substrate
Meas. Tech.
ChEMBL_1461891 (CHEMBL3396121)
IC50
2.8±n/a nM
Citation
 Jiang, XLiu, HSong, ZPeng, XJi, YYao, QGeng, MAi, JZhang, A Discovery and SAR study of c-Met kinase inhibitors bearing an 3-amino-benzo[d]isoxazole or 3-aminoindazole scaffold. Bioorg Med Chem 23:564-78 (2015)  
Target
Name:
Hepatocyte growth factor receptor
Synonyms:
Hepatocyte growth factor receptor Hepatocyte growth factor receptor (c-MET) MET Met proto-oncogene (hepatocyte growth factor receptor) Tyrosine-protein kinase Met (c-Met) c-Met kinase
Type:
Protein
Mol. Mass.:
155559.73
Organism:
Homo sapiens (Human)
Description:
P08581
Residue:
1390
  
Inhibitor
Name:
BDBM50060531
Synonyms:
CHEMBL3394457
Type:
Small organic molecule
Emp. Form.:
C24H18F2N4O3
Mol. Mass.:
448.4215
SMILES:
Nc1noc2cccc(-c3ccc(NC(=O)C4(CC4)C(=O)Nc4ccc(F)cc4)cc3F)c12
: