Target
Hepatocyte growth factor receptor
Ligand
BDBM50060555
Substrate
Meas. Tech.
ChEMBL_1461891 (CHEMBL3396121)
IC50
>1000±n/a nM
Citation
 Jiang, XLiu, HSong, ZPeng, XJi, YYao, QGeng, MAi, JZhang, A Discovery and SAR study of c-Met kinase inhibitors bearing an 3-amino-benzo[d]isoxazole or 3-aminoindazole scaffold. Bioorg Med Chem 23:564-78 (2015)  
Target
Name:
Hepatocyte growth factor receptor
Synonyms:
Hepatocyte growth factor receptor Hepatocyte growth factor receptor (c-MET) MET Met proto-oncogene (hepatocyte growth factor receptor) Tyrosine-protein kinase Met (c-Met) c-Met kinase
Type:
Protein
Mol. Mass.:
155559.73
Organism:
Homo sapiens (Human)
Description:
P08581
Residue:
1390
  
Inhibitor
Name:
BDBM50060555
Synonyms:
CHEMBL3394479
Type:
Small organic molecule
Emp. Form.:
C27H27FN6O2
Mol. Mass.:
486.5407
SMILES:
CN(C)Cc1cc(NC(=O)C2(CC2)C(=O)Nc2ccc(F)cc2)ccc1-c1cccc2[nH]nc(N)c12
: