Target
Vascular endothelial growth factor receptor 2
Ligand
BDBM50060508
Substrate
Meas. Tech.
ChEMBL_1461938 (CHEMBL3396251)
IC50
>1000±n/a nM
Citation
 Jiang, XLiu, HSong, ZPeng, XJi, YYao, QGeng, MAi, JZhang, A Discovery and SAR study of c-Met kinase inhibitors bearing an 3-amino-benzo[d]isoxazole or 3-aminoindazole scaffold. Bioorg Med Chem 23:564-78 (2015)  
Target
Name:
Vascular endothelial growth factor receptor 2
Synonyms:
CD_antigen=CD309 Fetal liver kinase 1 (FLK-1) KDR Protein-tyrosine kinase receptor Flk-1 VEGFR-2 VEGFR2 Vascular Endothelial Growth Factor Receptor Kinase 2 Vascular endothelial growth factor receptor 2 (KDR) Vascular endothelial growth factor receptor 2 (VEGFR2) Vascular endothelial growth factor receptor-2 (VEGFR-2)
Type:
Receptor Tyrosine Kinase
Mol. Mass.:
151510.97
Organism:
Homo sapiens (Human)
Description:
P35968
Residue:
1356
  
Inhibitor
Name:
BDBM50060508
Synonyms:
CHEMBL3394450
Type:
Small organic molecule
Emp. Form.:
C24H19FN4O3
Mol. Mass.:
430.4311
SMILES:
Nc1noc2cccc(-c3ccc(NC(=O)C4(CC4)C(=O)Nc4ccc(F)cc4)cc3)c12
: