Target
Histamine H4 receptor
Ligand
BDBM50061060
Substrate
Meas. Tech.
ChEMBL_1461283 (CHEMBL3396057)
Ki
2.0±n/a nM
Citation
 Savall, BMMeduna, SPTays, KCai, HThurmond, RLMcGovern, PGaul, MZhao, BPEdwards, JP Diaminopyrimidines, diaminopyridines and diaminopyridazines as histamine H4 receptor modulators. Bioorg Med Chem Lett 25:956-9 (2015)  
Target
Name:
Histamine H4 receptor
Synonyms:
AXOR35 GPCR105 HH4R HRH4 Histamine H4 receptor Histamine receptor (H3 and H4) SP9144
Type:
G Protein-Coupled Receptor (GPCR)
Mol. Mass.:
44517.02
Organism:
Homo sapiens (Human)
Description:
Binding assays were using CHO cells stably expressing hH4R receptors.
Residue:
390
  
Inhibitor
Name:
BDBM50061060
Synonyms:
CHEMBL3393539 | US9732087, 32
Type:
Small organic molecule
Emp. Form.:
C13H23N5
Mol. Mass.:
249.3552
SMILES:
CN[C@@H]1CCN(C1)c1ccnc(NCC(C)C)n1
: