Target
Cytochrome P450 1A2
Ligand
BDBM50061717
Substrate
Meas. Tech.
ChEMBL_1461967 (CHEMBL3396345)
IC50
>30000±n/a nM
Citation
 Orr, STBeveridge, RBhattacharya, SKCameron, KOCoffey, SFernando, DHepworth, DJackson, MVKhot, VKosa, RLapham, KLoria, PMMcClure, KFPatel, JRose, CSaenz, JStock, IAStorer, Gvon Volkenburg, MVrieze, DWang, GXiao, JZhang, Y Evaluation and synthesis of polar aryl- and heteroaryl spiroazetidine-piperidine acetamides as ghrelin inverse agonists. ACS Med Chem Lett 6:156-61 (2015)  
Target
Name:
Cytochrome P450 1A2
Synonyms:
CP1A2_HUMAN CYPIA2 Cytochrome P(3)450 Cytochrome P450 1A2 (CYP1A2) Cytochrome P450-P3
Type:
Enzyme
Mol. Mass.:
58423.38
Organism:
Homo sapiens (Human)
Description:
P05177
Residue:
516
  
Inhibitor
Name:
BDBM50061717
Synonyms:
CHEMBL3394201
Type:
Small organic molecule
Emp. Form.:
C31H35N5O3
Mol. Mass.:
525.6413
SMILES:
COc1ccc(CC(=O)N2CCC3(CN(C3)[C@@H]3CCc4cc(ccc34)-c3cc(C)ncn3)CC2)c(c1)C(N)=O
: