Target
Potassium voltage-gated channel subfamily H member 2
Ligand
BDBM50061730
Substrate
Meas. Tech.
ChEMBL_1462014 (CHEMBL3396464)
Ki
>15000±n/a nM
Citation
 Cheng, YBrown, JJudd, TCLopez, PQian, WPowers, TSChen, JJBartberger, MDChen, KDunn, RTEpstein, OFremeau, RTHarried, SHickman, DHitchcock, SALuo, YMinatti, AEPatel, VFVargas, HMWahl, RCWeiss, MMWen, PHWhite, RDWhittington, DAZheng, XMWood, S An Orally Available BACE1 Inhibitor That Affords Robust CNS Aß Reduction without Cardiovascular Liabilities. ACS Med Chem Lett 6:210-5 (2015)  
Target
Name:
Potassium voltage-gated channel subfamily H member 2
Synonyms:
1,3-beta-glucan synthase component GLS2 ERG Eag-related protein 1 Ether-a-go-go-related gene (HERG) Ether-a-go-go-related gene potassium channel 1 Ether-a-go-go-related gene potassium channel 1 (hERG1) Ether-a-go-go-related protein 1 H-ERG KCNH2 Potassium voltage-gated channel subfamily H member 2 (hERG) Voltage-gated potassium channel subunit Kv11.1 hERG Potassium Channel 1 | putative potassium channel subunit
Type:
Multi-pass membrane protein
Mol. Mass.:
126672.65
Organism:
Homo sapiens (Human)
Description:
Q12809
Residue:
1159
  
Inhibitor
Name:
BDBM50061730
Synonyms:
CHEMBL3394216
Type:
Small organic molecule
Emp. Form.:
C24H14F3N5O2
Mol. Mass.:
461.3955
SMILES:
NC1=N[C@@]2(CO1)c1cc(ccc1Oc1c(F)nc(cc21)-c1ccc(F)nc1)-c1cccnc1F
: