Target
ALK tyrosine kinase receptor
Ligand
BDBM50062371
Substrate
Meas. Tech.
ChEMBL_1462713 (CHEMBL3399441)
IC50
20000±n/a nM
Citation
 Abdelazem, AZAl-Sanea, MMPark, BSPark, HMYoo, KHSim, TPark, JBLee, SHLee, SH Synthesis and biological evaluation of new pyrazol-4-ylpyrimidine derivatives as potential ROS1 kinase inhibitors. Eur J Med Chem 90:195-208 (2015)  
Target
Name:
ALK tyrosine kinase receptor
Synonyms:
ALK ALK_HUMAN CD_antigen: CD246
Type:
Protein
Mol. Mass.:
176453.10
Organism:
Homo sapiens (Human)
Description:
Q9UM73
Residue:
1620
  
Inhibitor
Name:
BDBM50062371
Synonyms:
CHEMBL3397292
Type:
Small organic molecule
Emp. Form.:
C27H28N8O2
Mol. Mass.:
496.5636
SMILES:
Cc1cc(O)cc(c1)-c1nn(CC#N)cc1-c1cc(NCCN2CCOCC2)nc(n1)-c1cccnc1
: