Target
Proto-oncogene tyrosine-protein kinase ROS
Ligand
BDBM50062371
Substrate
Meas. Tech.
ChEMBL_1462712 (CHEMBL3399440)
IC50
478±n/a nM
Citation
 Abdelazem, AZAl-Sanea, MMPark, BSPark, HMYoo, KHSim, TPark, JBLee, SHLee, SH Synthesis and biological evaluation of new pyrazol-4-ylpyrimidine derivatives as potential ROS1 kinase inhibitors. Eur J Med Chem 90:195-208 (2015)  
Target
Name:
Proto-oncogene tyrosine-protein kinase ROS
Synonyms:
MCF3 Proto-oncogene c-Ros-1 ROS1 Receptor tyrosine kinase c-ros oncogene 1 c-Ros receptor tyrosine kinase
Type:
Enzyme
Mol. Mass.:
263897.39
Organism:
Homo sapiens (Human)
Description:
P08922
Residue:
2347
  
Inhibitor
Name:
BDBM50062371
Synonyms:
CHEMBL3397292
Type:
Small organic molecule
Emp. Form.:
C27H28N8O2
Mol. Mass.:
496.5636
SMILES:
Cc1cc(O)cc(c1)-c1nn(CC#N)cc1-c1cc(NCCN2CCOCC2)nc(n1)-c1cccnc1
: