Target
Proto-oncogene tyrosine-protein kinase ROS
Ligand
BDBM50062358
Substrate
Meas. Tech.
ChEMBL_1462712 (CHEMBL3399440)
IC50
1330±n/a nM
Citation
 Abdelazem, AZAl-Sanea, MMPark, BSPark, HMYoo, KHSim, TPark, JBLee, SHLee, SH Synthesis and biological evaluation of new pyrazol-4-ylpyrimidine derivatives as potential ROS1 kinase inhibitors. Eur J Med Chem 90:195-208 (2015)  
Target
Name:
Proto-oncogene tyrosine-protein kinase ROS
Synonyms:
MCF3 Proto-oncogene c-Ros-1 ROS1 Receptor tyrosine kinase c-ros oncogene 1 c-Ros receptor tyrosine kinase
Type:
Enzyme
Mol. Mass.:
263897.39
Organism:
Homo sapiens (Human)
Description:
P08922
Residue:
2347
  
Inhibitor
Name:
BDBM50062358
Synonyms:
CHEMBL3397294
Type:
Small organic molecule
Emp. Form.:
C24H22ClFN6O
Mol. Mass.:
464.922
SMILES:
COCCCNc1cc(nc(n1)-c1cccnc1)-c1cnc(C)nc1-c1ccc(F)cc1Cl
: