Target
Thiol:disulfide interchange protein DsbA
Ligand
BDBM50062364
Substrate
Meas. Tech.
ChEMBL_1462817 (CHEMBL3399656)
Kd
13100±n/a nM
Citation
 Duprez, WPremkumar, LHalili, MALindahl, FReid, RCFairlie, DPMartin, JL Peptide inhibitors of the Escherichia coli DsbA oxidative machinery essential for bacterial virulence. J Med Chem 58:577-87 (2015)  
Target
Name:
Thiol:disulfide interchange protein DsbA
Synonyms:
DSBA_ECOLI Thiol:disulfide interchange protein DsbA dsf ppfA
Type:
PROTEIN
Mol. Mass.:
23103.76
Organism:
Escherichia coli (strain K12)
Description:
ChEMBL_109722
Residue:
208
  
Inhibitor
Name:
BDBM50062364
Synonyms:
CHEMBL3397423
Type:
Small organic molecule
Emp. Form.:
C41H53N9O10S
Mol. Mass.:
863.979
SMILES:
C[C@@H](O)[C@H](NC(=O)[C@H](C)NC(=O)[C@H](Cc1c[nH]c2ccccc12)NC(=O)[C@@H]1Cc2ccccc2CN1C(=O)[C@H](CO)NC(=O)[C@@H]1CCCN1C(C)=O)C(=O)N[C@@H](CS)C(N)=O
: