Target
Cannabinoid receptor 2
Ligand
BDBM50062504
Substrate
Meas. Tech.
ChEMBL_1462820 (CHEMBL3399659)
Ki
90±n/a nM
Citation
 Bertini, SParkkari, TSavinainen, JRArena, CSaccomanni, GSaguto, SLigresti, AAllarà, MBruno, AMarinelli, LDi Marzo, VNovellino, EManera, CMacchia, M Synthesis, biological activity and molecular modeling of new biphenylic carboxamides as potent and selective CB2 receptor ligands. Eur J Med Chem 90:526-36 (2015)  
Target
Name:
Cannabinoid receptor 2
Synonyms:
CANNABINOID CB2 CB2 CB2B CNR2_HUMAN Cannabinoid CB2 receptor Cannabinoid receptor 2 (CB2R) | hCB2
Type:
G Protein-Coupled Receptor (GPCR)
Mol. Mass.:
39690.94
Organism:
Homo sapiens (Human)
Description:
P34972
Residue:
360
  
Inhibitor
Name:
BDBM50062504
Synonyms:
CHEMBL3397518
Type:
Small organic molecule
Emp. Form.:
C22H26FNO2
Mol. Mass.:
355.4457
SMILES:
COc1c(C)cc(cc1C(=O)N[C@H]1CC[C@H](C)CC1)-c1ccc(F)cc1
: