Target
Similar to alpha-tubulin isoform 1/Tubulin beta-2B chain
Ligand
BDBM50014846
Substrate
Meas. Tech.
ChEMBL_1462872 (CHEMBL3399784)
IC50
1700±n/a nM
Citation
 Suman, PMurthy, TRRajkumar, KSrikanth, DDayakar, ChKishor, CAddlagatta, AKalivendi, SVRaju, BC Synthesis and structure-activity relationships of pyridinyl-1H-1,2,3-triazolyldihydroisoxazoles as potent inhibitors of tubulin polymerization. Eur J Med Chem 90:603-19 (2015)  
Target
Name:
Similar to alpha-tubulin isoform 1/Tubulin beta-2B chain
Synonyms:
Tubulin
Type:
Mol. Mass.:
Description:
ASSAY_ID of ChEMBL is 1443869
Components:
This complex has 3 components.
Component 1
Name:
Similar to alpha-tubulin isoform 1
Synonyms:
Similar to alpha-tubulin isoform 1
Type:
PROTEIN
Mol. Mass.:
10383.05
Organism:
Bos taurus
Description:
ChEMBL_104716
Residue:
99
  
Component 2
Name:
Similar to alpha-tubulin isoform 1
Synonyms:
Tubulin
Type:
PROTEIN
Mol. Mass.:
9422.48
Organism:
Bos taurus
Description:
EBI_18002
Residue:
84
  
Component 3
Name:
Tubulin beta-2B chain
Synonyms:
TBB2B_BOVIN Tubulin | Tubulin beta chain
Type:
PROTEIN
Mol. Mass.:
49932.38
Organism:
Bos taurus
Description:
ChEMBL_211651
Residue:
445
  
Inhibitor
Name:
BDBM50014846
Synonyms:
(S)-N-(5,6,7,9-tetrahydro-1,2,3,10-tetramethoxy-9-oxobenzo[a]heptalen-7-yl)acetamide 7alphaH-colchicine COLCHICINE colchicina | colchicinum
Type:
Small organic molecule
Emp. Form.:
C22H25NO6
Mol. Mass.:
399.437
SMILES:
COc1cc2CC[C@H](NC(C)=O)c3cc(=O)c(OC)ccc3-c2c(OC)c1OC
: