Target
Telomerase reverse transcriptase
Ligand
BDBM50062608
Substrate
Meas. Tech.
ChEMBL_1462923 (CHEMBL3399863)
IC50
1980±n/a nM
Citation
 Shi, JBTang, WJQi, XBLi, RLiu, XH Novel pyrazole-5-carboxamide and pyrazole-pyrimidine derivatives: synthesis and anticancer activity. Eur J Med Chem 90:889-96 (2015)  
Target
Name:
Telomerase reverse transcriptase
Synonyms:
EST2 TERT TRT
Type:
PROTEIN
Mol. Mass.:
127099.03
Organism:
Homo sapiens (Human)
Description:
ChEMBL_1447029
Residue:
1132
  
Inhibitor
Name:
BDBM50062608
Synonyms:
CHEMBL3397658
Type:
Small organic molecule
Emp. Form.:
C17H20N4O2
Mol. Mass.:
312.3663
SMILES:
CCCc1nn(C)c(C(N)=O)c1NC(=O)\C=C\c1ccccc1
: