Target
Presenilin-1
Ligand
BDBM50273683
Substrate
Meas. Tech.
ChEMBL_1462965 (CHEMBL3398675)
IC50
22800±n/a nM
Citation
 Flesch, DNess, JLamers, CDehm, FPopella, SSteri, ROgorek, IHieke, MDannhardt, GWerz, OWeggen, SSchubert-Zsilavecz, M SAR-studies of¿-secretase modulators with PPAR¿-agonistic and 5-lipoxygenase-inhibitory activity for Alzheimer's disease. Bioorg Med Chem Lett 25:841-6 (2015)  
Target
Name:
Presenilin-1
Synonyms:
3.4.23.- Gamma-Secretase Subunit Presenilin-1 PS1 PSEN1 PSNL1 Presenilin-1 CTF12 Protein S182
Type:
Mol. Mass.:
52657.13
Organism:
Homo sapiens (Human)
Description:
P49768
Residue:
467
  
Inhibitor
Name:
BDBM50273683
Synonyms:
2-(4,6-Diphenethoxypyrimidin-2-ylthio)hexanoic acid | CHEMBL461883
Type:
Small organic molecule
Emp. Form.:
C26H30N2O4S
Mol. Mass.:
466.592
SMILES:
CCCCC(Sc1nc(OCCc2ccccc2)cc(OCCc2ccccc2)n1)C(O)=O
: