Target
Presenilin-1
Ligand
BDBM50396066
Substrate
Meas. Tech.
ChEMBL_1462966 (CHEMBL3398676)
EC50
1100±n/a nM
Citation
 Flesch, DNess, JLamers, CDehm, FPopella, SSteri, ROgorek, IHieke, MDannhardt, GWerz, OWeggen, SSchubert-Zsilavecz, M SAR-studies of¿-secretase modulators with PPAR¿-agonistic and 5-lipoxygenase-inhibitory activity for Alzheimer's disease. Bioorg Med Chem Lett 25:841-6 (2015)  
Target
Name:
Presenilin-1
Synonyms:
3.4.23.- Gamma-Secretase Subunit Presenilin-1 PS1 PSEN1 PSNL1 Presenilin-1 CTF12 Protein S182
Type:
Mol. Mass.:
52657.13
Organism:
Homo sapiens (Human)
Description:
P49768
Residue:
467
  
Inhibitor
Name:
BDBM50396066
Synonyms:
CHEMBL1819479
Type:
Small organic molecule
Emp. Form.:
C29H26F6O4
Mol. Mass.:
552.5048
SMILES:
CCCC\C(=C/c1cc(OCc2ccc(cc2)C(F)(F)F)ccc1OCc1ccc(cc1)C(F)(F)F)C(O)=O
: