Target
Myeloblastin
Ligand
BDBM50063047
Substrate
Meas. Tech.
ChEMBL_1463425 (CHEMBL3399762)
IC50
220±n/a nM
Citation
 Hwang, TLWang, WHWang, TYYu, HPHsieh, PW Synthesis and pharmacological characterization of 2-aminobenzaldehyde oxime analogs as dual inhibitors of neutrophil elastase and proteinase 3. Bioorg Med Chem 23:1123-34 (2015)  
Target
Name:
Myeloblastin
Synonyms:
Leukocyte proteinase 3 PRTN3 | PRTN3_HUMAN
Type:
PROTEIN
Mol. Mass.:
27816.30
Organism:
Homo sapiens (Human)
Description:
ChEMBL_1463425
Residue:
256
  
Inhibitor
Name:
BDBM50063047
Synonyms:
CHEMBL3398148
Type:
Small organic molecule
Emp. Form.:
C19H22N2O5S
Mol. Mass.:
390.453
SMILES:
C\C(=N\O)c1ccccc1NS(=O)(=O)c1ccc(OC(=O)C(C)(C)C)cc1
: