Target
Myeloblastin
Ligand
BDBM50101988
Substrate
Meas. Tech.
ChEMBL_1463425 (CHEMBL3399762)
IC50
530±n/a nM
Citation
 Hwang, TLWang, WHWang, TYYu, HPHsieh, PW Synthesis and pharmacological characterization of 2-aminobenzaldehyde oxime analogs as dual inhibitors of neutrophil elastase and proteinase 3. Bioorg Med Chem 23:1123-34 (2015)  
Target
Name:
Myeloblastin
Synonyms:
Leukocyte proteinase 3 PRTN3 | PRTN3_HUMAN
Type:
PROTEIN
Mol. Mass.:
27816.30
Organism:
Homo sapiens (Human)
Description:
ChEMBL_1463425
Residue:
256
  
Inhibitor
Name:
BDBM50101988
Synonyms:
CHEMBL3398153
Type:
Small organic molecule
Emp. Form.:
C18H20N2O5S
Mol. Mass.:
376.427
SMILES:
CC(C)(C)C(=O)Oc1ccc(cc1)S(=O)(=O)Nc1ccccc1\C=N/O
: