Target
Peroxisome proliferator-activated receptor gamma
Ligand
BDBM50377302
Substrate
Meas. Tech.
ChEMBL_1463123 (CHEMBL3399106)
IC50
20.0±n/a nM
Citation
 Zhang, HDing, CZLai, ZChen, SSDevasthale, PHerpin, TMorton, GQu, FRyono, DSmirk, RWang, WWu, SYe, XXLi, YXApedo, AFarrelly, DWang, TGu, LMorgan, NFlynn, NChu, CKunselman, LLippy, JLocke, KO'Malley, KHarrity, TCap, MZhang, LHosagrahara, VKadiyala, PXu, CDoweyko, AMZahler, RHariharan, NCheng, PT Synthesis and biological evaluation of novel pyrrolidine acid analogs as potent dual PPARa/¿ agonists. Bioorg Med Chem Lett 25:1196-205 (2015)  
Target
Name:
Peroxisome proliferator-activated receptor gamma
Synonyms:
NR1C3 PPAR-gamma PPARG_HUMAN Peroxisome proliferator-activated receptor gamma (PPAR gamma) Peroxisome proliferator-activated receptor gamma (PPARγ) peroxisome proliferator-activated receptor gamma isoform 2
Type:
Nuclear Receptor
Mol. Mass.:
57613.46
Organism:
Homo sapiens (Human)
Description:
P37231
Residue:
505
  
Inhibitor
Name:
BDBM50377302
Synonyms:
CHEMBL255930
Type:
Small organic molecule
Emp. Form.:
C29H27F3N4O4
Mol. Mass.:
552.5443
SMILES:
Cc1oc(nc1CCOc1ccc(C[C@@H]2CN(C[C@@H]2C(O)=O)c2nccc(n2)C(F)(F)F)cc1)-c1ccccc1
: